{"text_format":"1","workbook":"xlsx","n_sheets":2,"sheets":["大会申込書","data"],"not_rendered":{"charts":0,"images":1,"macros":1,"external_links":0,"defined_names":79,"comments":0,"pivot_tables":0},"unopened":[],"bounds":{"document_bytes":16777216,"sheet_cells":100000,"rows_first":2000,"rows_last":500,"rows_between":2000,"halvings":0,"cell_chars":16384,"cell_head_chars":4096},"cells_cut":0,"cells_raw":0,"read":"whole","date_system":"1900"}

{"sheet":"大会申込書","index":0,"n_rows":35,"n_cols":20,"rows_kept":35,"cut":false,"hidden":false,"merged":[[1,0,1,7],[22,1,23,1],[22,2,23,2],[22,3,23,3],[22,4,23,4],[6,7,7,7],[5,0,5,2],[5,3,5,4],[5,6,5,7],[18,0,19,0],[18,5,19,5],[20,0,21,0],[20,5,21,5],[18,1,19,1],[18,2,19,2],[18,3,19,3],[2,9,3,11],[10,1,11,1],[10,2,11,2],[10,3,11,3],[10,4,11,4],[6,1,6,2],[6,3,6,4],[8,1,9,1],[8,2,9,2],[8,3,9,3],[8,4,9,4],[4,0,4,4],[6,5,7,5],[6,10,6,11],[8,5,9,5],[10,0,11,0],[16,4,17,4],[24,1,25,1],[24,2,25,2],[24,3,25,3],[24,4,25,4],[14,3,15,3],[14,4,15,4],[6,6,7,6],[6,8,7,8],[6,9,7,9],[4,6,4,11],[6,0,7,0],[14,1,15,1],[14,2,15,2],[14,11,15,11],[8,11,9,11],[12,0,13,0],[12,5,13,5],[12,11,13,11],[10,5,11,5],[12,1,13,1],[12,2,13,2],[12,3,13,3],[12,4,13,4],[10,11,11,11],[5,8,5,11],[8,0,9,0],[24,10,25,10],[8,10,9,10],[10,10,11,10],[12,10,13,10],[14,10,15,10],[16,10,17,10],[18,10,19,10],[20,10,21,10],[22,10,23,10],[18,4,19,4],[16,0,17,0],[16,5,17,5],[16,1,17,1],[16,2,17,2],[16,3,17,3],[22,11,23,11],[20,11,21,11],[20,1,21,1],[20,2,21,2],[20,3,21,3],[20,4,21,4],[34,2,34,10],[0,10,0,11],[1,10,1,11],[24,0,25,0],[24,5,25,5],[24,11,25,11],[2,0,2,3],[3,0,3,3],[2,4,2,8],[3,4,3,8],[16,11,17,11],[14,0,15,0],[14,5,15,5],[18,11,19,11],[22,0,23,0],[22,5,23,5]]}
[null,null,null,null,null,null,null,null,"申込書の改訂","申込書作成日","登録dataの更新"]
["   倉敷ソフトテニス協会  大会申込書　（令和６年度版）\n未登録団体は昨年データの仮版（2024年6月末まで有効）です",null,null,null,null,null,null,null,"改正12　2021/6/1\n改正13　2022/3/9\n改正14　2023/3/24\n改正15　2023/3/28\n改正16　2024/3/16",null,"更新81　2024/01/12\n更新82　2024/01/31\n更新83　2024/03/16\n更新84　2024/03/25\n更新85　2024/03/30"]
["大会名"]
["加盟団体名"]
["申込(連絡）責任者",null,null,null,null,"氏名",{"$f":"IF(D6=\" \",\" \",VLOOKUP(D6,data!K:M,3,0))","v":" "}]
["団体No",null,null,null,null,"連絡先",{"$f":"IF(D6=\" \",\" \",VLOOKUP(D6,data!K:O,4,0))","v":" "},null,{"$f":"IF(D6=\" \",\" \",VLOOKUP(D6,data!K:O,5,0))","v":" "},null,null,null,null,null,null,"種別１","種別２","種別３","種別４","大会名"]
["No","種別\n(両方選択)",null,"種目\n（どちらかを選択）",null,"強者\n順位","選手","所　　属　（略称）","氏　　　名","個人登録№","不成立時上位クラスへ移動OKかを選択"]
[null,"個人\n団体","男・女\nミックス","個人","団体\nミックス",null,null,null,null,null,"1ランク","2ランク",null,null,null,"個人","男子","★年齢★","★団体★","倉敷市春季ミックスソフトテニス大会"]
[1,null,null,null,null,null,"A",null,null,null,null,null,null,null,null,"団体","女子","ジュニアI","ジュニア","倉敷市春季ソフトテニス大会"]
[null,null,null,null,null,null,"B",null,null,null,null,null,null,null,null,null,"ミックス","ジュニアII","一般A","倉敷市春季加盟団体対抗ソフトテニス大会　"]
[2,null,null,null,null,null,"A",null,null,null,null,null,null,null,null,null,null,"一般","一般B","倉敷市近郷ソフトテニス大会"]
[null,null,null,null,null,null,"B",null,null,null,null,null,null,null,null,null,null,"成年","シニア１部","倉敷市水島港ソフトテニス大会"]
[3,null,null,null,null,null,"A",null,null,null,null,null,null,null,null,null,null,"シニア４５","シニア２部","倉敷市ソフトテニス選手権大会"]
[null,null,null,null,null,null,"B",null,null,null,null,null,null,null,null,null,null,"シニア５０","★ミックス★","倉敷市秋季加盟団体対抗ソフトテニス大会"]
[4,null,null,null,null,null,"A",null,null,null,"　","　",null,null,null,null,null,"シニア５５","ジュニアI","倉敷スポーツフェスティバルソフトテニス大会"]
[null,null,null,null,null,null,"B",null,null,null,null,null,null,null,null,null,null,"シニア６０","ジュニアII","倉敷市秋季ミックスソフトテニス大会"]
[5,null,null,null,null,null,"A",null,null,null,"　","　",null,null,null,null,null,"シニア６５","一般","倉敷市県知事杯争奪ソフトテニス大会"]
[null,null,null,null,null,null,"B",null,null,null,null,null,null,null,null,null,null,"シニア７０",70,"倉敷市冬季ソフトテニス選手権大会"]
[6,null,null,null,null,null,"A",null,null,null,"　","　",null,null,null,null,null,"シニア７５",100,"倉敷市シングルスダブルスソフトテニス大会"]
[null,null,null,null,null,null,"B",null,null,null,null,null,null,null,null,null,null,null,110]
[7,null,null,null,null,null,"A",null,null,null,"　","　",null,null,null,null,null,null,120]
[null,null,null,null,null,null,"Ｂ",null,null,null,null,null,null,null,null,null,null,null,130]
[8,null,null,null,null,null,"A",null,null,null,"　","　",null,null,null,null,null,null,140]
[null,null,null,null,null,null,"Ｂ"]
[9,null,null,null,null,null,"A",null,null,null,"　","　"]
[null,null,null,null,null,null,"Ｂ"]
["　記入上の注意"]
["１．行は詰めて入力をお願いします。　"]
["２．大会名及び種別，種目，所属，氏名，不成立時の移動は選択で、黄色網掛けの強者順位のみが入力です。(半角数字で入力）"]
["３．不成立時が　××：エントリーを取下。（参加料は不要）　記入なし：上位クラス(2ランク迄）へ変更を行います。"]
["４．関数を使って入力の効率化を行っています。　最新バージョンをホームページからダウンロードして利用ください。"]
["５．Eメールにて送付ください。 　KSTA大会エントリ係　ksta-entry@outlook.com"]
[]
["【連絡欄】"]
[null,null,"※加盟団体登録が終わっていない団体がありますので2024年6月末までは仮版にて運用します。"]

{"sheet":"data","index":1,"n_rows":911,"n_cols":16,"rows_kept":911,"cut":false,"hidden":true,"merged":[]}
["個人登録№","氏名","ふりがな","a","b","c","団体No","所属団体名","更新日",null,"団体No","団体名（加盟届の名称）","連絡責任者","連絡先","Eメール","2024登録"]
[602002,"荒川　周一郎","ｱﾗｶﾜ　ｼｭｳｲﾁﾛｳ",null,null,null,602,"ＪＦＥスチール㈱西日本ソフトテニス部","2023-06-06",null,602,"ＪＦＥスチール西日本","阿部　一博"]
[602003,"木曽　幸夫","ｷｿ　ﾕｷｵ",null,null,null,602,"ＪＦＥスチール㈱西日本ソフトテニス部","2023-06-06",null,603,"ENEOS","奥山　浩史","090-1186-2507","okuyamah@f7.dion.ne.jp"]
[602004,"河内　純男","ｶﾜﾁ　ｽﾐｵ",null,null,null,602,"ＪＦＥスチール㈱西日本ソフトテニス部","2023-06-06",null,604,"KLF","高尾","080-1920-5921","silvia.s15.1010@gmail.com "]
[602005,"河本  厚彦","ｺｳﾓﾄ　ｱﾂﾋｺ",null,null,null,602,"ＪＦＥスチール㈱西日本ソフトテニス部","2023-06-06",null,606,"しらかべクラブ","永瀬　範明","080-1949-2833","czp01344@nifty.com ","〇"]
[602006,"藤原　靖夫","ﾌｼﾞﾜﾗ　ﾔｽｵ",null,null,null,602,"ＪＦＥスチール㈱西日本ソフトテニス部","2023-06-06",null,607,"玉島ソフトテニスクラブ","川上　雄司","080-6318-9376","kawakuni105@gmail.com"]
[602007,"阿部　一博","ｱﾍﾞ　ｶｽﾞﾋﾛ",null,null,null,602,"ＪＦＥスチール㈱西日本ソフトテニス部","2023-06-06",null,608,"粒江ソフトテニスクラブ","松本　厚子","090-4895-2725","ami.nana.bin@af.wakwak.com","〇"]
[602008,"所司　真和","ｼｮｼ　ﾏｻｶｽﾞ",null,null,null,602,"ＪＦＥスチール㈱西日本ソフトテニス部","2023-06-06",null,609,"プロシードテニスクラブ","徳弘　桂子","090-8241-4735","keikott@d3.dion.ne.jp","〇"]
[602012,"森松　駿","ﾓﾘﾏﾂ　ﾀｶｼ",null,null,null,602,"ＪＦＥスチール㈱西日本ソフトテニス部","2023-06-06",null,610,"真備ソフトテニスクラブ","荻野　潤一郎","086-486-3570","legendogino@hi3.enjoy.ne.jp","〇"]
[602013,"木曽　嵩之","ｷｿ　ﾀｶﾕｷ",null,null,null,602,"ＪＦＥスチール㈱西日本ソフトテニス部","2023-06-06",null,611,"竜王ソフトテニスクラブ","西原　浩","080-6316-1287","Washukids2003@gmail.com"]
[602014,"小野田　理人","ｵﾉﾀﾞ　ﾏｻﾄ",null,null,null,602,"ＪＦＥスチール㈱西日本ソフトテニス部","2023-06-06",null,622,"井原テニスクラブ","前田　綾子","080-1931-5164","happysmile.ayako0820@gmail.com "]
[602018,"片岡　靖亮","ｶﾀｵｶ　ﾔｽｱｷ",null,null,null,602,"ＪＦＥスチール㈱西日本ソフトテニス部","2023-06-06",null,623,"きしもとソフトテニスクラブ","井上　崇史","090-5703-5455","tnfa0105@gmail.com"]
[602025,"青山　佳裕","ｱｵﾔﾏ　ﾖｼﾋﾛ",null,null,null,602,"ＪＦＥスチール㈱西日本ソフトテニス部","2023-06-06",null,624,"鬼の城ソフトテニスクラブ","高橋　浩一","090-3377-6341","taka9320@po1.oninet.ne.jp","〇"]
[602029,"三木　仁登","ﾐｷ　ﾏｻﾄ",null,null,null,602,"ＪＦＥスチール㈱西日本ソフトテニス部","2023-06-06",null,625,"倉敷さわやか会","古里　瑞枝","090-5267-2640","furufurumi070463@gmail.com"]
[602044,"水田  佳邦","ﾐｽﾞﾀ　ﾖｼｸﾆ",null,null,null,602,"ＪＦＥスチール㈱西日本ソフトテニス部","2023-06-06",null,626,"総社クラブ","野平俊憲","090-2003-0338","st.xyst@gmail.com","〇"]
[602046,"江田　快翔","エダ　カイショウ",null,null,null,602,"ＪＦＥスチール㈱西日本ソフトテニス部","2023-06-10",null,627,"ダンディズム","西崎　康晴","090-3636-3131","yasu_z5511@yahoo.co.jp"]
[602048,"田上　誠人","ﾀﾉｳｴ　ﾏｺﾄ",null,null,null,602,"ＪＦＥスチール㈱西日本ソフトテニス部","2023-06-06",null,628,"高梁ソフトテニスクラブ","川西　基隆","090-2291-1687","nukesaku2000@gmail.com"]
[602049,"有本　一貴","ｱﾘﾓﾄ　ｶｽﾞｷ",null,null,null,602,"ＪＦＥスチール㈱西日本ソフトテニス部","2023-06-06",null,633,"クラレ倉敷","吉岡　雅敏","090-9737-0371","masatosshishiori@yahoo.co.jp"]
[602050,"藤原　基弘","フジワラ　モトヒロ",null,null,null,602,"ＪＦＥスチール㈱西日本ソフトテニス部","2023-06-10",null,635,"コスモ・クラブ","松尾　達也","090-1339-3100","s136933@yahoo.co.jp"]
[602051,"首藤　友樹","シュトウ　トモキ",null,null,null,602,"ＪＦＥスチール㈱西日本ソフトテニス部","2023-06-10",null,637,"新来島サノヤス造船ソフトテニス部","大森　瞬","090-4908-4462","s_o1985s@yahoo.co.jp"]
[602052,"木屋　陽介","キヤ　ヨウスケ",null,null,null,602,"ＪＦＥスチール㈱西日本ソフトテニス部","2023-06-10",null,638,"茶屋町ソフトテニスクラブ","大森　要人","090-7978-0399","h0h36zs2@ene.megaegg.ne.jp","〇"]
[603001,"宮崎　幹男",null,null,null,null,603,"ENEOS","2023-06-06",null,640,"早島ソフトテニスクラブ","西田　一歩","090-3749-9555","nishida-kazu0212@ezweb.ne.jp"]
[603002,"竹本　昌登",null,null,null,null,603,"ENEOS","2023-06-06",null,643,"高梁松山城クラブ","矢吹 章","090-7372-2119","ayabuki@cap.ocn.ne.jp","〇"]
[603003,"川上　敏明",null,null,null,null,603,"ENEOS","2023-06-06",null,645,"遥照ソフトテニスクラブ","藤原　憲明","090-1333-8748","purin050328@yahoo.co.jp"]
[603004,"石井　靖浩",null,null,null,null,603,"ENEOS","2023-06-06",null,647,"味琴テニスクラブ","吉田　隆幸","090-2809-1281","takayuki0124mouse@softbank.ne.jp"]
[603005,"田中　正彦",null,null,null,null,603,"ENEOS","2023-06-06",null,651,"スフィーダテニスクラブ","杉山　忍","090-2298-7972","takasago007x@air.ocn.ne.jp"]
[603006,"中村　知敬",null,null,null,null,603,"ENEOS","2023-06-06",null,658,"ももっち岡山ジュニア","吉岡　雅敏","090-9737-0371","masatosshishiori@yahoo.co.jp"]
[603007,"中村　智子",null,null,null,null,603,"ENEOS","2023-06-06",null,659,"Washu Kids","西原　浩","080-6316-1287","Washukids2003@gmail.com"]
[603008,"奥山浩史",null,null,null,null,603,"ENEOS","2023-06-06",null,660,"エナジーJSTC","石井　早苗","090-5696-1445","rsx36187@nifty.com"]
[603010,"藤原　忠",null,null,null,null,603,"ENEOS","2023-06-06",null,661,"総社ジュニアソフトテニスクラブ","林　史朗","090-4103-4551","hayashi_fkmr@yahoo.co.jp"]
[603011,"古谷野　智博",null,null,null,null,603,"ENEOS","2023-06-06",null,663,"島田家","光森康修","090-2803-2941","y.m.lt.0528@gmail.com"]
[603016,"中島　淳一",null,null,null,null,603,"ENEOS","2023-06-06",null,664,"備前とくり会ジュニア","形山 秀昭",null,"ktym@alto.ocn.ne.jp"]
[603017,"藤澤　健史",null,null,null,null,603,"ENEOS","2023-06-06",null,665,"マスカット","松井　裕倫","080-5236-4597","mh69596959@gmail.com"]
[603018,"中原　雄一",null,null,null,null,603,"ENEOS","2023-06-06",null,666,"金光ソフトテニスクラブ","渡辺　健太",null,"wassyoi0302@icloud.com"]
[603020,"石井　佑一",null,null,null,null,603,"ENEOS","2023-06-06",null,669,"岡山kidsソフトテニスクラブ","川上　洋一","080-8236-6978","kawakami.0724.5066@gmail.com"]
[603023,"和田　悟",null,null,null,null,603,"ENEOS","2023-06-06",null,671,"Pastel","重実　裕子","080-5610-7537","muget.convallaria-keiskei@ezweb.ne.jp","〇"]
[603024,"西森　和希",null,null,null,null,603,"ENEOS","2023-06-06",null,672,"清音ジュニアソフトテニス","枝松　明人","090-9852-5032","jrbsfbreak161@yahoo.co.jp"]
[603025,"光森　隆之",null,null,null,null,603,"ENEOS","2023-06-06",null,673,"BARON","安福　和歩","080-241-8660","s.h.nanozi900@gmail.com","〇"]
[603026,"池本　和生",null,null,null,null,603,"ENEOS","2023-06-06",null,675,"玉野市ジュニアソフトテニスクラブ","坂井　陽一","090-2292-1336","yk. jul20.2008@gmail. com"]
[603028,"小野 和則",null,null,null,null,603,"ENEOS","2023-06-06",null,678,"LSE","渡部 紘也","080-2999-9248","hiroya-watanabe@s.okayama-u.ac.jp"]
[603029,"藤田 健輔",null,null,null,null,603,"ENEOS","2023-06-06",null,679,"LIFE","下山 流生","070-3771-9915","appleryuki@icloud.com","〇"]
[603031,"浅野 佑月",null,null,null,null,603,"ENEOS","2023-06-06"]
[603033,"小見山 大輝",null,null,null,null,603,"ENEOS","2023-06-06"]
[603034,"中村　真夏",null,null,null,null,603,"ENEOS","2023-06-06"]
[603035,"河本　恵",null,null,null,null,603,"ENEOS","2023-06-06"]
[603039,"中村 香住",null,null,null,null,603,"ENEOS","2023-06-06"]
[603042,"田中　快希",null,null,null,null,603,"ENEOS","2023-06-06"]
[603043,"森宗　陽平",null,null,null,null,603,"ENEOS","2023-06-06"]
[603044,"田中　由佳",null,null,null,null,603,"ENEOS","2023-06-06"]
[603045,"藤岡　瑞樹",null,null,null,null,603,"ENEOS","2023-06-06"]
[603046,"阿部 明日香","あべあすか",null,null,null,603,"ENEOS","2023-08-03"]
[604012,"小野　博徳","おの　ひろのり",null,null,null,604,"ＫＬＦ","2023-04-03"]
[604013,"高尾　泰光","たかお　やすみつ",null,null,null,604,"ＫＬＦ","2023-04-03"]
[604014,"岡本　太郎","おかもと　たろう",null,null,null,604,"ＫＬＦ","2023-04-03"]
[604015,"竹本　光之輔","たけもと　こうのすけ",null,null,null,604,"ＫＬＦ","2023-04-03"]
[604016,"中村　力将","なかむら　よしまさ",null,null,null,604,"ＫＬＦ","2023-04-03"]
[604017,"小林　直樹","こばやし　なおき",null,null,null,604,"ＫＬＦ","2023-04-03"]
[604018,"牧野　孝紀","まきの　こうき",null,null,null,604,"ＫＬＦ","2023-04-03"]
[604019,"山内　一輝","やまうち　かずき",null,null,null,604,"ＫＬＦ","2023-04-03"]
[604020,"岩瀬　禎広","いわせ　さだひろ",null,null,null,604,"ＫＬＦ","2023-04-03"]
[604021,"白石　祐仁","しらいし　ゆうじ",null,null,null,604,"ＫＬＦ","2023-04-03"]
[604022,"植木　基行","うえき　もとゆき",null,null,null,604,"ＫＬＦ","2023-04-03"]
[604023,"成澤　祐介","なりさわ　ゆうすけ",null,null,null,604,"ＫＬＦ","2023-04-03"]
[604024,"田村　欣宏","たむら　よしひろ",null,null,null,604,"ＫＬＦ","2023-04-03"]
[604025,"嶋田　翔太","しまだ　しょうた",null,null,null,604,"ＫＬＦ","2023-04-03"]
[604026,"越智　奨太","おち　しょうた",null,null,null,604,"ＫＬＦ","2023-04-03"]
[604027,"安井　拓夢","やすい　たくむ",null,null,null,604,"ＫＬＦ","2023-04-03"]
[604028,"日高　司","ひだか　つかさ",null,null,null,604,"ＫＬＦ","2023-04-03"]
[604029,"小野　椋平","おの　りょうへい",null,null,null,604,"ＫＬＦ","2023-04-03"]
[606001,"小松原　雅記","こまつばら　ただふみ",null,null,null,606,"しらかべクラブ","2024-03-29"]
[606002,"土本　宣行","つちもと　のぶゆき",null,null,null,606,"しらかべクラブ","2024-03-29"]
[606003,"永瀬　範明","ながせ　のりあき",null,null,null,606,"しらかべクラブ","2024-03-29"]
[606004,"庵谷　一郎","いほりや　いちろう",null,null,null,606,"しらかべクラブ","2024-03-29"]
[606006,"小野　尚彦","おの　なおひこ",null,null,null,606,"しらかべクラブ","2024-03-29"]
[606008,"秋庭　朋子","あきば　ともこ",null,null,null,606,"しらかべクラブ","2024-03-29"]
[606009,"三宅　伸一","みやけ　しんいち",null,null,null,606,"しらかべクラブ","2024-03-29"]
[606010,"永瀬　啓子","ながせ　けいこ",null,null,null,606,"しらかべクラブ","2024-03-29"]
[606011,"吉澤　和之","よしざわ　かずゆき",null,null,null,606,"しらかべクラブ","2024-03-29"]
[606013,"武政　勉","たけまさ　つとむ",null,null,null,606,"しらかべクラブ","2024-03-29"]
[606015,"北田　晃弘","きただ　あきひろ",null,null,null,606,"しらかべクラブ","2024-03-29"]
[606016,"大嶋　欣也","おおしま　きんや",null,null,null,606,"しらかべクラブ","2024-03-29"]
[606018,"宮地　郁夫","みやじ　いくお",null,null,null,606,"しらかべクラブ","2024-03-29"]
[606019,"難波　兼広","なんば　かねひろ",null,null,null,606,"しらかべクラブ","2024-03-29"]
[606021,"羽賀　千晶","はが　ちあき",null,null,null,606,"しらかべクラブ","2024-03-29"]
[606023,"藤原　幸司","ふじわら　こうじ",null,null,null,606,"しらかべクラブ","2024-03-29"]
[606026,"太田　吉昭","おおた　よしあき",null,null,null,606,"しらかべクラブ","2024-03-29"]
[606027,"山中　政人","やまなか　まさと",null,null,null,606,"しらかべクラブ","2024-03-29"]
[606029,"秋庭　朋和","あきば　ともかず",null,null,null,606,"しらかべクラブ","2024-03-29"]
[606030,"川上　真二","かわかみ　しんじ",null,null,null,606,"しらかべクラブ","2024-03-29"]
[606031,"榧　清人","かや　きよと",null,null,null,606,"しらかべクラブ","2024-03-29"]
[606042,"茅原　秀志","かやはら　しゅうし",null,null,null,606,"しらかべクラブ","2024-03-29"]
[606050,"澤田　康孝","さわだ　やすたか",null,null,null,606,"しらかべクラブ","2024-03-29"]
[606051,"庵谷　紘美","いほりや　ひろみ",null,null,null,606,"しらかべクラブ","2024-03-29"]
[606053,"小関　学","こせき　まなぶ",null,null,null,606,"しらかべクラブ","2024-03-29"]
[606054,"冨繁　崇","とみしげ　たかし",null,null,null,606,"しらかべクラブ","2024-03-29"]
[606057,"久保　毅","くぼ　つよし",null,null,null,606,"しらかべクラブ","2024-03-29"]
[606061,"西村　亮佑","にしむら　りょうすけ",null,null,null,606,"しらかべクラブ","2024-03-29"]
[606063,"高木 大成","たかぎ　たいせい",null,null,null,606,"しらかべクラブ","2024-03-29"]
[606066,"別府　孝則","べっぷ　たかのり",null,null,null,606,"しらかべクラブ","2024-03-29"]
[606067,"村木　章平","むらき　しょうへい",null,null,null,606,"しらかべクラブ","2024-03-29"]
[606068," 岡    史浩","おか　　ふみひろ",null,null,null,606,"しらかべクラブ","2024-03-29"]
[606071,"清水　辰海","しみず　たつみ",null,null,null,606,"しらかべクラブ","2024-03-29"]
[606072," 坂井　祐二"," さかい　ゆうじ",null,null,null,606,"しらかべクラブ","2024-03-29"]
[606074,"森分　元雄","もりわけ　もとお",null,null,null,606,"しらかべクラブ","2024-03-29"]
[606075,"白石　隼翔","しらいし　しゅんと",null,null,null,606,"しらかべクラブ","2024-03-29"]
[606076,"妹尾　桂子","せのお　けいこ",null,null,null,606,"しらかべクラブ","2024-03-29"]
[606077,"江原　良明","えばら　よしあき",null,null,null,606,"しらかべクラブ","2024-03-29"]
[606078,"新本　唯","しんもと　ゆい",null,null,null,606,"しらかべクラブ","2024-03-29"]
[606079,"最相　智保　","さいしょう　ともやす",null,null,null,606,"しらかべクラブ","2024-03-29"]
[606080,"山下　晃輝","やました　こうき",null,null,null,606,"しらかべクラブ","2024-03-29"]
[606081,"川井　一浩","かわかみ　しんじ",null,null,null,606,"しらかべクラブ","2024-03-29"]
[607001,"古沢　英二","ふるさわ えいじ",null,null,null,607,"玉島ソフトテニスクラブ","2023-06-06"]
[607002,"黒田　哲司","くろだ てつし",null,null,null,607,"玉島ソフトテニスクラブ","2023-06-06"]
[607003,"川上　雄司","かわかみ ゆうじ",null,null,null,607,"玉島ソフトテニスクラブ","2023-06-06"]
[607005,"小幡　憲司","おばた けんじ",null,null,null,607,"玉島ソフトテニスクラブ","2023-06-06"]
[607006,"渡辺　敬志","わたなべ　けいし",null,null,null,607,"玉島ソフトテニスクラブ","2023-06-06"]
[607007,"木科　孝夫","きしな たかお",null,null,null,607,"玉島ソフトテニスクラブ","2023-06-06"]
[607008,"渡辺　健二","わたなべ　けんじ",null,null,null,607,"玉島ソフトテニスクラブ","2023-06-06"]
[607009,"佐藤　敬治","さとう　けいじ",null,null,null,607,"玉島ソフトテニスクラブ","2023-06-06"]
[607010,"安部　信一郎","あべ　しんいちろう",null,null,null,607,"玉島ソフトテニスクラブ","2023-06-06"]
[607011,"山田　和夫","やまだ　かずお",null,null,null,607,"玉島ソフトテニスクラブ","2023-06-06"]
[607012,"山田　美鈴","やまだ　みすず",null,null,null,607,"玉島ソフトテニスクラブ","2023-06-06"]
[607013,"樋之津　秀治","ひのつ　しゅうじ",null,null,null,607,"玉島ソフトテニスクラブ","2023-06-06"]
[607014,"福本　喜典","ふくもと　よしのり",null,null,null,607,"玉島ソフトテニスクラブ","2023-06-06"]
[607015,"山田　喜大","やまだ　はるき",null,null,null,607,"玉島ソフトテニスクラブ","2023-06-06"]
[607017,"小椋　初恵","おぐらはつえ",null,null,null,607,"玉島ソフトテニスクラブ","2023-06-06"]
[607019,"山田　広起","やまだひろき",null,null,null,607,"玉島ソフトテニスクラブ","2023-06-06"]
[607020,"中野　亮","なかの　りょう",null,null,null,607,"玉島ソフトテニスクラブ","2023-06-06"]
[607021,"中野　典子","なかの　のりこ",null,null,null,607,"玉島ソフトテニスクラブ","2023-06-06"]
[607022,"西井　保","にしい　たもつ",null,null,null,607,"玉島ソフトテニスクラブ","2023-06-06"]
[607028,"河本　歩","こうもと　あゆむ",null,null,null,607,"玉島ソフトテニスクラブ","2023-06-06"]
[608001,"秋庭祐三","あきば　ゆうぞう",null,null,null,608,"粒江ソフトテニスクラブ","2024-03-29"]
[608003,"片岡忠明","かたおか　ただあき",null,null,null,608,"粒江ソフトテニスクラブ","2024-03-29"]
[608004,"片山栄二郎","かたやまえいじろう",null,null,null,608,"粒江ソフトテニスクラブ","2024-03-29"]
[608008,"小西洋","こにし　ひろし",null,null,null,608,"粒江ソフトテニスクラブ","2024-03-29"]
[608011,"杉田治子","すぎた　はるこ",null,null,null,608,"粒江ソフトテニスクラブ","2024-03-29"]
[608012,"瀬良春美","せら　はるみ",null,null,null,608,"粒江ソフトテニスクラブ","2024-03-29"]
[608013,"武田次郎","たけだ　じろう",null,null,null,608,"粒江ソフトテニスクラブ","2024-03-29"]
[608017,"藤森由喜子","ふじもり　ゆきこ",null,null,null,608,"粒江ソフトテニスクラブ","2024-03-29"]
[608018,"升田忠行","ますだ　ただゆき",null,null,null,608,"粒江ソフトテニスクラブ","2024-03-29"]
[608019,"増成春吉","ますなり　はるよし",null,null,null,608,"粒江ソフトテニスクラブ","2024-03-29"]
[608022,"松本厚子","まつもと　あつこ",null,null,null,608,"粒江ソフトテニスクラブ","2024-03-29"]
[608023,"三宅広志","みやけ　ひろし",null,null,null,608,"粒江ソフトテニスクラブ","2024-03-29"]
[608024,"宗重みどり","むねしげ　みどり",null,null,null,608,"粒江ソフトテニスクラブ","2024-03-29"]
[608027,"岡本信吾","おかもと　しんご",null,null,null,608,"粒江ソフトテニスクラブ","2024-03-29"]
[608029,"土肥孝寿","とひ　たかひさ",null,null,null,608,"粒江ソフトテニスクラブ","2024-03-29"]
[608032,"末藤正人","すえとう　まさと",null,null,null,608,"粒江ソフトテニスクラブ","2024-03-29"]
[608033,"武政美穂子","たけまさ　みほこ",null,null,null,608,"粒江ソフトテニスクラブ","2024-03-29"]
[609001,"細野　慎之輔","ほその　しんのすけ",null,null,null,609,"プロシードテニスクラブ","2024-03-29"]
[609002,"岩崎　邦彦","いわさき　くにひこ",null,null,null,609,"プロシードテニスクラブ","2024-03-29"]
[609003,"常久　正則","つねひさ　まさのり",null,null,null,609,"プロシードテニスクラブ","2024-03-29"]
[609004,"芳上　秀夫","よしがみ　ひでお",null,null,null,609,"プロシードテニスクラブ","2024-03-29"]
[609005,"佐田野　勝","さだの　まさる",null,null,null,609,"プロシードテニスクラブ","2024-03-29"]
[609007,"小椋　誠二","おぐら　せいじ",null,null,null,609,"プロシードテニスクラブ","2024-03-29"]
[609008,"徳弘　徹","とくひろ　とおる",null,null,null,609,"プロシードテニスクラブ","2024-03-29"]
[609009,"山口　智久","やまぐち　ともひさ",null,null,null,609,"プロシードテニスクラブ","2024-03-29"]
[609010,"坂口　岩実","さかぐち　いわみ",null,null,null,609,"プロシードテニスクラブ","2024-03-29"]
[609011,"藤原　亮","ふじわら　あきら",null,null,null,609,"プロシードテニスクラブ","2024-03-29"]
[609016,"油野木 由美子","ゆのき　ゆみこ",null,null,null,609,"プロシードテニスクラブ","2024-03-29"]
[609018,"徳弘　桂子","とくひろ　けいこ",null,null,null,609,"プロシードテニスクラブ","2024-03-29"]
[609022,"高橋　啓介","たかはし　けいすけ",null,null,null,609,"プロシードテニスクラブ","2024-03-29"]
[609028,"浅越　誠","あさごえ　まこと",null,null,null,609,"プロシードテニスクラブ","2024-03-29"]
[609041,"三浦　好司","みうら　こうじ",null,null,null,609,"プロシードテニスクラブ","2024-03-29"]
[609043,"森宗　浩慈","もりむね　こうじ",null,null,null,609,"プロシードテニスクラブ","2024-03-29"]
[609044,"山崎　晋弥","やまさき　しんや",null,null,null,609,"プロシードテニスクラブ","2024-03-29"]
[609046,"細野　英子","ほその　えいこ",null,null,null,609,"プロシードテニスクラブ","2024-03-29"]
[609052,"早田　雅之","はやた　まさゆき",null,null,null,609,"プロシードテニスクラブ","2024-03-29"]
[609053,"水野　克敏","みずの　かつとし",null,null,null,609,"プロシードテニスクラブ","2024-03-29"]
[609054,"堀内　強","ほりうち　つよし",null,null,null,609,"プロシードテニスクラブ","2024-03-29"]
[609055,"神本　圭介","かみもと　けいすけ",null,null,null,609,"プロシードテニスクラブ","2024-03-29"]
[609061,"宗田　健","そうた　たけし",null,null,null,609,"プロシードテニスクラブ","2024-03-29"]
[609064,"三木　保秀","みき　やすひで",null,null,null,609,"プロシードテニスクラブ","2024-03-29"]
[609065,"藤原　潔志","ふじわら　きよし",null,null,null,609,"プロシードテニスクラブ","2024-03-29"]
[609066,"原田　愛果","はらだ　あいか",null,null,null,609,"プロシードテニスクラブ","2024-03-29"]
[609067,"岡本　圭司","おかもと　けいじ",null,null,null,609,"プロシードテニスクラブ","2024-03-29"]
[609070,"栗尾　淳史","くりお　あつし",null,null,null,609,"プロシードテニスクラブ","2024-03-29"]
[609071,"石井　祐樹","いしい　ゆうき",null,null,null,609,"プロシードテニスクラブ","2024-03-29"]
[609073,"宮地　悠斗","みやぢ　ひろと",null,null,null,609,"プロシードテニスクラブ","2024-03-29"]
[609076,"岡野　光真","おかの　みつまさ",null,null,null,609,"プロシードテニスクラブ","2024-03-29"]
[609087,"荒木　大空","あらき　そら",null,null,null,609,"プロシードテニスクラブ","2024-03-29"]
[609090,"光森　伸一","みつもり　しんいち",null,null,null,609,"プロシードテニスクラブ","2024-03-29"]
[609091,"篠埜　護","ささの　まもる",null,null,null,609,"プロシードテニスクラブ","2024-03-29"]
[609092,"西端　健彦","にしばた　たけひこ",null,null,null,609,"プロシードテニスクラブ","2024-03-29"]
[609093,"上岡　千恵美","うえおか　ちえみ",null,null,null,609,"プロシードテニスクラブ","2024-03-29"]
[609094,"小林　豊","こばやし　ゆたか",null,null,null,609,"プロシードテニスクラブ","2024-03-29"]
[609096,"安達　覚史","あだち　さとし",null,null,null,609,"プロシードテニスクラブ","2024-03-29"]
[609097,"三原　和也","みはら　かずや",null,null,null,609,"プロシードテニスクラブ","2024-03-29"]
[609098,"中戸　亮輔","なかと　りょうすけ",null,null,null,609,"プロシードテニスクラブ","2024-03-29"]
[609100,"山下　浩司","やました　こうじ",null,null,null,609,"プロシードテニスクラブ","2024-03-29"]
[609101,"竹本　幸紘","たけもと　ゆきひろ",null,null,null,609,"プロシードテニスクラブ","2024-03-29"]
[609102,"谷許　裕哉","やもと　ゆうや",null,null,null,609,"プロシードテニスクラブ","2024-03-29"]
[609103,"大西　琢瑛","おおにし　たくえい",null,null,null,609,"プロシードテニスクラブ","2024-03-29"]
[609104,"濵田　敬太","はまだ　けいた",null,null,null,609,"プロシードテニスクラブ","2024-03-29"]
[610002,"田村　敏朗","タムラトシロウ",null,null,null,610,"真備ソフトテニスクラブ","2024-03-29"]
[610007,"小川　喜一","オガワ　キイチ",null,null,null,610,"真備ソフトテニスクラブ","2024-03-29"]
[610008,"小野　和明","オノ　カズアキ",null,null,null,610,"真備ソフトテニスクラブ","2024-03-29"]
[610009,"田村　幸二","タムラ　コウジ",null,null,null,610,"真備ソフトテニスクラブ","2024-03-29"]
[610010,"服部　研二","ハットリ　ケンジ",null,null,null,610,"真備ソフトテニスクラブ","2024-03-29"]
[610012,"枝松　明人","エダマツ　アキヒト",null,null,null,610,"真備ソフトテニスクラブ","2024-03-29"]
[610013,"石井　信義","イシイ　ノブヨシ",null,null,null,610,"真備ソフトテニスクラブ","2024-03-29"]
{"$rows_left_out":711}